[Dev-luatex] Revision 3761 compile failing on Windows Vista

Graham Douglas graham.douglas at readytext.co.uk
Wed Jul 28 22:03:05 CEST 2010


Hi Taco

Here's the very start of the errors --- indeed it is something to
do with config.h as you suspected.

Hope this helps

All the best

Graham

===============================

In file included from ../../../source/texk/web2c/mplibdir/tfmin.w:46:
../../../source/texk/web2c/w2c/config.h:1: error: syntax error before 
'.' token
In file included from ../../../source/texk/web2c/mplibdir/tfmin.w:46:
../../../source/texk/web2c/w2c/config.h:1:17: warning: no newline at end 
of file

In file included from ../../../source/texk/web2c/mplibdir/tfmin.w:47:
g:/MinGW/bin/../lib/gcc/mingw32/3.4.5/../../../../include/stdio.h:191: 
error: sy
ntax error before "size_t"
g:/MinGW/bin/../lib/gcc/mingw32/3.4.5/../../../../include/stdio.h:207: 
error: sy
ntax error before "size_t"
g:/MinGW/bin/../lib/gcc/mingw32/3.4.5/../../../../include/stdio.h:211: 
error: sy
ntax error before "size_t"
g:/MinGW/bin/../lib/gcc/mingw32/3.4.5/../../../../include/stdio.h:319: 
error: sy
ntax error before "size_t"
g:/MinGW/bin/../lib/gcc/mingw32/3.4.5/../../../../include/stdio.h:320: 
error: sy
ntax error before "size_t"
g:/MinGW/bin/../lib/gcc/mingw32/3.4.5/../../../../include/stdio.h:330: 
error: sy
ntax error before "size_t"
g:/MinGW/bin/../lib/gcc/mingw32/3.4.5/../../../../include/stdio.h:331: 
error: sy
ntax error before "size_t"
g:/MinGW/bin/../lib/gcc/mingw32/3.4.5/../../../../include/stdio.h:411: 
error: sy
ntax error before "fread"
g:/MinGW/bin/../lib/gcc/mingw32/3.4.5/../../../../include/stdio.h:412: 
error: sy
ntax error before "fwrite"
In file included from ../../../source/texk/web2c/mplibdir/tfmin.w:47:
g:/MinGW/bin/../lib/gcc/mingw32/3.4.5/../../../../include/stdio.h:564: 
error: sy
ntax error before "size_t"
g:/MinGW/bin/../lib/gcc/mingw32/3.4.5/../../../../include/stdio.h:567: 
error: sy
ntax error before "size_t"
g:/MinGW/bin/../lib/gcc/mingw32/3.4.5/../../../../include/stdio.h:603: 
error: sy
ntax error before "size_t"
g:/MinGW/bin/../lib/gcc/mingw32/3.4.5/../../../../include/stdio.h:604: 
error: sy
ntax error before "size_t"
g:/MinGW/bin/../lib/gcc/mingw32/3.4.5/../../../../include/stdio.h:607: 
error: sy
ntax error before "size_t"
g:/MinGW/bin/../lib/gcc/mingw32/3.4.5/../../../../include/stdio.h: In 
function `
vsnwprintf':
g:/MinGW/bin/../lib/gcc/mingw32/3.4.5/../../../../include/stdio.h:608: 
error: `s
' undeclared (first use in this function)
g:/MinGW/bin/../lib/gcc/mingw32/3.4.5/../../../../include/stdio.h:608: 
error: (E
ach undeclared identifier is reported only once
g:/MinGW/bin/../lib/gcc/mingw32/3.4.5/../../../../include/stdio.h:608: 
error: fo
r each function it appears in.)
g:/MinGW/bin/../lib/gcc/mingw32/3.4.5/../../../../include/stdio.h:608: 
error: `n
' undeclared (first use in this function)
g:/MinGW/bin/../lib/gcc/mingw32/3.4.5/../../../../include/stdio.h:608: 
error: `f
ormat' undeclared (first use in this function)
g:/MinGW/bin/../lib/gcc/mingw32/3.4.5/../../../../include/stdio.h:608: 
error: `a
rg' undeclared (first use in this function)
In file included from ../../../source/texk/web2c/mplibdir/tfmin.w:48:
g:/MinGW/bin/../lib/gcc/mingw32/3.4.5/../../../../include/stdlib.h: At 
top level
:
g:/MinGW/bin/../lib/gcc/mingw32/3.4.5/../../../../include/stdlib.h:348: 
error: s
yntax error before "size_t"
g:/MinGW/bin/../lib/gcc/mingw32/3.4.5/../../../../include/stdlib.h:353: 
error: s
yntax error before "wcstombs"
g:/MinGW/bin/../lib/gcc/mingw32/3.4.5/../../../../include/stdlib.h:356: 
error: s
yntax error before "size_t"
g:/MinGW/bin/../lib/gcc/mingw32/3.4.5/../../../../include/stdlib.h:357: 
error: s
yntax error before "mbstowcs"
g:/MinGW/bin/../lib/gcc/mingw32/3.4.5/../../../../include/stdlib.h:358: 
error: s
yntax error before "size_t"
g:/MinGW/bin/../lib/gcc/mingw32/3.4.5/../../../../include/stdlib.h:365: 
error: s
yntax error before "size_t"
g:/MinGW/bin/../lib/gcc/mingw32/3.4.5/../../../../include/stdlib.h:377: 
error: s
yntax error before "size_t"
g:/MinGW/bin/../lib/gcc/mingw32/3.4.5/../../../../include/stdlib.h:378: 
error: s
yntax error before ')' token
g:/MinGW/bin/../lib/gcc/mingw32/3.4.5/../../../../include/stdlib.h:379: 
error: s
yntax error before "size_t"
g:/MinGW/bin/../lib/gcc/mingw32/3.4.5/../../../../include/stdlib.h:380: 
error: s
yntax error before ')' token
g:/MinGW/bin/../lib/gcc/mingw32/3.4.5/../../../../include/stdlib.h:426: 
error: s
yntax error before "size_t"
In file included from ../../../source/texk/web2c/mplibdir/tfmin.w:49:
g:/MinGW/bin/../lib/gcc/mingw32/3.4.5/../../../../include/string.h:36: 
error: sy
ntax error before "size_t"
g:/MinGW/bin/../lib/gcc/mingw32/3.4.5/../../../../include/string.h:37: 
error: sy
ntax error before "size_t"
g:/MinGW/bin/../lib/gcc/mingw32/3.4.5/../../../../include/string.h:38: 
error: sy
ntax error before "size_t"
g:/MinGW/bin/../lib/gcc/mingw32/3.4.5/../../../../include/string.h:39: 
error: sy
ntax error before "size_t"
g:/MinGW/bin/../lib/gcc/mingw32/3.4.5/../../../../include/string.h:40: 
error: sy
ntax error before "size_t"
g:/MinGW/bin/../lib/gcc/mingw32/3.4.5/../../../../include/string.h:46: 
error: sy
ntax error before "strcspn"
g:/MinGW/bin/../lib/gcc/mingw32/3.4.5/../../../../include/string.h:49: 
error: sy
ntax error before "strlen"
g:/MinGW/bin/../lib/gcc/mingw32/3.4.5/../../../../include/string.h:50: 
error: sy
ntax error before "size_t"
g:/MinGW/bin/../lib/gcc/mingw32/3.4.5/../../../../include/string.h:51: 
error: sy
ntax error before "size_t"
g:/MinGW/bin/../lib/gcc/mingw32/3.4.5/../../../../include/string.h:52: 
error: sy
ntax error before "size_t"
g:/MinGW/bin/../lib/gcc/mingw32/3.4.5/../../../../include/string.h:55: 
error: sy
ntax error before "strspn"
g:/MinGW/bin/../lib/gcc/mingw32/3.4.5/../../../../include/string.h:58: 
error: sy
ntax error before "strxfrm"
g:/MinGW/bin/../lib/gcc/mingw32/3.4.5/../../../../include/string.h:65: 
error: sy
ntax error before "size_t"
g:/MinGW/bin/../lib/gcc/mingw32/3.4.5/../../../../include/string.h:66: 
error: sy
ntax error before "size_t"
g:/MinGW/bin/../lib/gcc/mingw32/3.4.5/../../../../include/string.h:72: 
error: sy
ntax error before "size_t"
g:/MinGW/bin/../lib/gcc/mingw32/3.4.5/../../../../include/string.h:73: 
error: sy
ntax error before "size_t"
g:/MinGW/bin/../lib/gcc/mingw32/3.4.5/../../../../include/string.h:77: 
error: sy
ntax error before "size_t"
g:/MinGW/bin/../lib/gcc/mingw32/3.4.5/../../../../include/string.h:80: 
error: sy
ntax error before "size_t"
g:/MinGW/bin/../lib/gcc/mingw32/3.4.5/../../../../include/string.h:81: 
error: sy
ntax error before "size_t"
g:/MinGW/bin/../lib/gcc/mingw32/3.4.5/../../../../include/string.h:90: 
error: sy
ntax error before "size_t"
g:/MinGW/bin/../lib/gcc/mingw32/3.4.5/../../../../include/string.h:91: 
error: sy
ntax error before "size_t"
g:/MinGW/bin/../lib/gcc/mingw32/3.4.5/../../../../include/string.h:103: 
error: s
yntax error before "size_t"
g:/MinGW/bin/../lib/gcc/mingw32/3.4.5/../../../../include/string.h:104: 
error: s
yntax error before "size_t"
g:/MinGW/bin/../lib/gcc/mingw32/3.4.5/../../../../include/string.h:107: 
error: s
yntax error before "size_t"
g:/MinGW/bin/../lib/gcc/mingw32/3.4.5/../../../../include/string.h: In 
function
`strncasecmp':
g:/MinGW/bin/../lib/gcc/mingw32/3.4.5/../../../../include/string.h:108: 
error: `
__sz1' undeclared (first use in this function)
g:/MinGW/bin/../lib/gcc/mingw32/3.4.5/../../../../include/string.h:108: 
error: `
__sz2' undeclared (first use in this function)
g:/MinGW/bin/../lib/gcc/mingw32/3.4.5/../../../../include/string.h:108: 
error: `
__sizeMaxCompare' undeclared (first use in this function)
g:/MinGW/bin/../lib/gcc/mingw32/3.4.5/../../../../include/string.h: At 
top level
:
g:/MinGW/bin/../lib/gcc/mingw32/3.4.5/../../../../include/string.h:110: 
error: s
yntax error before "size_t"
g:/MinGW/bin/../lib/gcc/mingw32/3.4.5/../../../../include/string.h:115: 
error: s
yntax error before "size_t"
g:/MinGW/bin/../lib/gcc/mingw32/3.4.5/../../../../include/string.h:131: 
error: s
yntax error before "wcscspn"
g:/MinGW/bin/../lib/gcc/mingw32/3.4.5/../../../../include/string.h:133: 
error: s
yntax error before "wcslen"
g:/MinGW/bin/../lib/gcc/mingw32/3.4.5/../../../../include/string.h:134: 
error: s
yntax error before "size_t"
g:/MinGW/bin/../lib/gcc/mingw32/3.4.5/../../../../include/string.h:135: 
error: s
yntax error before "size_t"
g:/MinGW/bin/../lib/gcc/mingw32/3.4.5/../../../../include/string.h:136: 
error: s
yntax error before "size_t"
g:/MinGW/bin/../lib/gcc/mingw32/3.4.5/../../../../include/string.h:139: 
error: s
yntax error before "wcsspn"
g:/MinGW/bin/../lib/gcc/mingw32/3.4.5/../../../../include/string.h:142: 
error: s
yntax error before "wcsxfrm"
g:/MinGW/bin/../lib/gcc/mingw32/3.4.5/../../../../include/string.h:156: 
error: s
yntax error before "size_t"
g:/MinGW/bin/../lib/gcc/mingw32/3.4.5/../../../../include/string.h:157: 
error: s
yntax error before "size_t"
g:/MinGW/bin/../lib/gcc/mingw32/3.4.5/../../../../include/string.h:163: 
error: s
yntax error before "size_t"
g:/MinGW/bin/../lib/gcc/mingw32/3.4.5/../../../../include/string.h:164: 
error: s
yntax error before "size_t"
g:/MinGW/bin/../lib/gcc/mingw32/3.4.5/../../../../include/string.h:183: 
error: s
yntax error before "size_t"
g:/MinGW/bin/../lib/gcc/mingw32/3.4.5/../../../../include/string.h:184: 
error: s
yntax error before "size_t"
In file included from ../../../source/texk/web2c/mplibdir/tfmin.w:50:
../../../source/texk/web2c/mplibdir/mp.w:571: error: syntax error before 
"size_t
"
../../../source/texk/web2c/mplibdir/mp.w:572: error: syntax error before 
"size_t
"
../../../source/texk/web2c/mplibdir/mp.w:577: error: syntax error before 
"size_t
"
../../../source/texk/web2c/mplibdir/mp.w:1044: error: syntax error 
before "size_
t"
../../../source/texk/web2c/mplibdir/mp.w:1044: warning: no semicolon at 
end of s
truct or union
../../../source/texk/web2c/mplibdir/mp.w:1046: error: syntax error 
before '}' to
ken
../../../source/texk/web2c/mplibdir/mp.w:1046: warning: type defaults to 
`int' i
n declaration of `mp_lstring'
../../../source/texk/web2c/mplibdir/mp.w:1046: warning: data definition 
has no t
ype or storage class
../../../source/texk/web2c/mplibdir/mp.w:1047: error: syntax error 
before '*' to
ken
../../../source/texk/web2c/mplibdir/mp.w:1047: warning: type defaults to 
`int' i
n declaration of `str_number'
../../../source/texk/web2c/mplibdir/mp.w:1047: warning: data definition 
has no t
ype or storage class
../../../source/texk/web2c/mplibdir/mp.w:26237: error: syntax error 
before "size
_t"
../../../source/texk/web2c/mplibdir/mp.w:26237: warning: no semicolon at 
end of
struct or union
../../../source/texk/web2c/mplibdir/mp.w:26238: warning: type defaults 
to `int'
in declaration of `used'
../../../source/texk/web2c/mplibdir/mp.w:26238: warning: data definition 
has no
type or storage class
../../../source/texk/web2c/mplibdir/mp.w:26239: warning: type defaults 
to `int'
in declaration of `mp_stream'
../../../source/texk/web2c/mplibdir/mp.w:26239: warning: data definition 
has no
type or storage class
../../../source/texk/web2c/mplibdir/mp.w:26241: error: syntax error 
before "mp_s
tream"
../../../source/texk/web2c/mplibdir/mp.w:26241: warning: no semicolon at 
end of
struct or union
../../../source/texk/web2c/mplibdir/mp.w:26242: warning: type defaults 
to `int'
in declaration of `error_out'
../../../source/texk/web2c/mplibdir/mp.w:26242: warning: data definition 
has no
type or storage class
../../../source/texk/web2c/mplibdir/mp.w:26243: error: syntax error 
before "log_
out"
../../../source/texk/web2c/mplibdir/mp.w:26243: warning: type defaults 
to `int'
in declaration of `log_out'
../../../source/texk/web2c/mplibdir/mp.w:26243: warning: data definition 
has no
type or storage class
../../../source/texk/web2c/mplibdir/mp.w:26244: error: syntax error 
before "ps_o
ut"
../../../source/texk/web2c/mplibdir/mp.w:26244: warning: type defaults 
to `int'
in declaration of `ps_out'
../../../source/texk/web2c/mplibdir/mp.w:26244: warning: data definition 
has no
type or storage class
../../../source/texk/web2c/mplibdir/mp.w:26245: error: syntax error 
before "term
_in"
../../../source/texk/web2c/mplibdir/mp.w:26245: warning: type defaults 
to `int'
in declaration of `term_in'
../../../source/texk/web2c/mplibdir/mp.w:26245: warning: data definition 
has no
type or storage class
../../../source/texk/web2c/mplibdir/mp.w:26247: error: syntax error 
before '}' t
oken
../../../source/texk/web2c/mplibdir/mp.w:26247: warning: type defaults 
to `int'
in declaration of `mp_run_data'
../../../source/texk/web2c/mplibdir/mp.w:26247: warning: data definition 
has no
type or storage class
../../../source/texk/web2c/mplibdir/mp.w:26530: error: syntax error 
before '*' t
oken
../../../source/texk/web2c/mplibdir/mp.w:26530: warning: type defaults 
to `int'
in declaration of `mp_rundata'
../../../source/texk/web2c/mplibdir/mp.w:26530: warning: data definition 
has no
type or storage class
../../../source/texk/web2c/mplibdir/mp.w:26681: error: syntax error 
before "size
_t"
In file included from ../../../source/texk/web2c/mplibdir/mp.w:128,
                  from ../../../source/texk/web2c/mplibdir/tfmin.w:51:
../../../source/texk/web2c/mplibdir/avl.h:42: warning: parameter names 
(without
types) in function declaration
In file included from ../../../source/texk/web2c/mplibdir/tfmin.w:51:
../../../source/texk/web2c/mplibdir/mp.w:2677: error: syntax error 
before "size_
t"
../../../source/texk/web2c/mplibdir/mp.w:2679: error: syntax error 
before "size_
t"
../../../source/texk/web2c/mplibdir/mp.w:2680: error: syntax error 
before "size_
t"
../../../source/texk/web2c/mplibdir/mp.w:2682: error: syntax error 
before "size_
t"
../../../source/texk/web2c/mplibdir/mp.w:2651: error: syntax error 
before "str_n
umber"
../../../source/texk/web2c/mplibdir/mp.w:2651: warning: no semicolon at 
end of s
truct or union
../../../source/texk/web2c/mplibdir/mp.w:2655: error: syntax error 
before '}' to
ken
../../../source/texk/web2c/mplibdir/mp.w:2655: warning: type defaults to 
`int' i
n declaration of `mp_value_data'
../../../source/texk/web2c/mplibdir/mp.w:2655: warning: data definition 
has no t
ype or storage class
../../../source/texk/web2c/mplibdir/mp.w:2658: error: syntax error 
before "mp_va
lue_data"
../../../source/texk/web2c/mplibdir/mp.w:2658: warning: no semicolon at 
end of s
truct or union
../../../source/texk/web2c/mplibdir/mp.w:2659: warning: type defaults to 
`int' i
n declaration of `mp_value'
../../../source/texk/web2c/mplibdir/mp.w:2659: warning: data definition 
has no t
ype or storage class
../../../source/texk/web2c/mplibdir/mp.w:3979: error: syntax error 
before "mp_va
lue"
../../../source/texk/web2c/mplibdir/mp.w:3979: warning: no semicolon at 
end of s
truct or union
../../../source/texk/web2c/mplibdir/mp.w:3981: error: syntax error 
before '}' to
ken
../../../source/texk/web2c/mplibdir/mp.w:3981: warning: type defaults to 
`int' i
n declaration of `mp_internal'
../../../source/texk/web2c/mplibdir/mp.w:3981: warning: data definition 
has no t
ype or storage class
../../../source/texk/web2c/mplibdir/mp.w:4381: error: syntax error 
before "mp_va
lue"
../../../source/texk/web2c/mplibdir/mp.w:4381: warning: no semicolon at 
end of s
truct or union
../../../source/texk/web2c/mplibdir/mp.w:4382: warning: type defaults to 
`int' i
n declaration of `text'
../../../source/texk/web2c/mplibdir/mp.w:4382: warning: data definition 
has no t
ype or storage class
../../../source/texk/web2c/mplibdir/mp.w:4383: warning: type defaults to 
`int' i
n declaration of `mp_symbol_entry'
../../../source/texk/web2c/mplibdir/mp.w:4383: warning: data definition 
has no t
ype or storage class
../../../source/texk/web2c/mplibdir/mp.w:6421: error: syntax error 
before "mp_in
ternal"
../../../source/texk/web2c/mplibdir/mp.w:6421: warning: no semicolon at 
end of s
truct or union
../../../source/texk/web2c/mplibdir/mp.w:6426: error: syntax error 
before '}' to
ken
../../../source/texk/web2c/mplibdir/mp.w:6426: warning: type defaults to 
`int' i
n declaration of `mp_save_data'
../../../source/texk/web2c/mplibdir/mp.w:6426: warning: data definition 
has no t
ype or storage class
../../../source/texk/web2c/mplibdir/mp.w:13973: error: syntax error 
before "str_
number"
../../../source/texk/web2c/mplibdir/mp.w:13973: warning: no semicolon at 
end of
struct or union
../../../source/texk/web2c/mplibdir/mp.w:13975: error: syntax error 
before '}' t
oken
../../../source/texk/web2c/mplibdir/mp.w:13975: warning: type defaults 
to `int'
in declaration of `in_state_record'
../../../source/texk/web2c/mplibdir/mp.w:13975: warning: data definition 
has no
type or storage class
../../../source/texk/web2c/mplibdir/mp.w:818: error: syntax error before 
"size_t
"
../../../source/texk/web2c/mplibdir/mp.w:818: warning: no semicolon at 
end of st
ruct or union
../../../source/texk/web2c/mplibdir/mp.w:821: error: syntax error before 
"first"

../../../source/texk/web2c/mplibdir/mp.w:821: warning: type defaults to 
`int' in
  declaration of `first'
../../../source/texk/web2c/mplibdir/mp.w:821: warning: data definition 
has no ty
pe or storage class
../../../source/texk/web2c/mplibdir/mp.w:822: error: syntax error before 
"last"
../../../source/texk/web2c/mplibdir/mp.w:822: warning: type defaults to 
`int' in
  declaration of `last'
../../../source/texk/web2c/mplibdir/mp.w:822: warning: data definition 
has no ty
pe or storage class
../../../source/texk/web2c/mplibdir/mp.w:823: error: syntax error before 
"max_bu
f_stack"
../../../source/texk/web2c/mplibdir/mp.w:823: warning: type defaults to 
`int' in
  declaration of `max_buf_stack'
../../../source/texk/web2c/mplibdir/mp.w:823: warning: data definition 
has no ty
pe or storage class
../../../source/texk/web2c/mplibdir/mp.w:892: error: conflicting types 
for 'term
_in'
../../../source/texk/web2c/mplibdir/mp.w:26245: error: previous 
declaration of '
term_in' was here
../../../source/texk/web2c/mplibdir/mp.w:1052: error: syntax error 
before "cur_l
ength"
../../../source/texk/web2c/mplibdir/mp.w:1052: warning: type defaults to 
`int' i
n declaration of `cur_length'
../../../source/texk/web2c/mplibdir/mp.w:1052: warning: data definition 
has no t
ype or storage class
../../../source/texk/web2c/mplibdir/mp.w:1053: error: syntax error 
before "cur_s
tring_size"
../../../source/texk/web2c/mplibdir/mp.w:1053: warning: type defaults to 
`int' i
n declaration of `cur_string_size'
../../../source/texk/web2c/mplibdir/mp.w:1053: warning: data definition 
has no t
ype or storage class
../../../source/texk/web2c/mplibdir/mp.w:1928: error: syntax error 
before "err_h
elp"
../../../source/texk/web2c/mplibdir/mp.w:1928: warning: type defaults to 
`int' i
n declaration of `err_help'
../../../source/texk/web2c/mplibdir/mp.w:1928: warning: data definition 
has no t
ype or storage class
../../../source/texk/web2c/mplibdir/mp.w:2965: error: syntax error 
before "var_u
sed"
../../../source/texk/web2c/mplibdir/mp.w:2965: warning: type defaults to 
`int' i
n declaration of `var_used'
../../../source/texk/web2c/mplibdir/mp.w:2965: warning: data definition 
has no t
ype or storage class
../../../source/texk/web2c/mplibdir/mp.w:2966: error: syntax error 
before "var_u
sed_max"
../../../source/texk/web2c/mplibdir/mp.w:2966: warning: type defaults to 
`int' i
n declaration of `var_used_max'
../../../source/texk/web2c/mplibdir/mp.w:2966: warning: data definition 
has no t
ype or storage class
../../../source/texk/web2c/mplibdir/mp.w:3995: error: syntax error 
before '*' to
ken
../../../source/texk/web2c/mplibdir/mp.w:3995: warning: type defaults to 
`int' i
n declaration of `internal'
../../../source/texk/web2c/mplibdir/mp.w:3995: warning: data definition 
has no t
ype or storage class
../../../source/texk/web2c/mplibdir/mp.w:6429: error: syntax error 
before '*' to
ken
../../../source/texk/web2c/mplibdir/mp.w:6429: warning: type defaults to 
`int' i
n declaration of `save_ptr'
../../../source/texk/web2c/mplibdir/mp.w:6429: warning: data definition 
has no t
ype or storage class
../../../source/texk/web2c/mplibdir/mp.w:13919: error: syntax error 
before "cur_
mod_str"
../../../source/texk/web2c/mplibdir/mp.w:13919: warning: type defaults 
to `int'
in declaration of `cur_mod_str'
../../../source/texk/web2c/mplibdir/mp.w:13919: warning: data definition 
has no
type or storage class
../../../source/texk/web2c/mplibdir/mp.w:13978: error: syntax error 
before '*' t
oken
../../../source/texk/web2c/mplibdir/mp.w:13978: warning: type defaults 
to `int'
in declaration of `input_stack'
../../../source/texk/web2c/mplibdir/mp.w:13978: warning: data definition 
has no
type or storage class
../../../source/texk/web2c/mplibdir/mp.w:13981: error: syntax error 
before "cur_
input"
../../../source/texk/web2c/mplibdir/mp.w:13981: warning: type defaults 
to `int'
in declaration of `cur_input'
../../../source/texk/web2c/mplibdir/mp.w:13981: warning: data definition 
has no
type or storage class
../../../source/texk/web2c/mplibdir/mp.w:14093: error: syntax error 
before '*' t
oken
../../../source/texk/web2c/mplibdir/mp.w:14093: warning: type defaults 
to `int'
in declaration of `mpx_name'
../../../source/texk/web2c/mplibdir/mp.w:14093: warning: data definition 
has no
type or storage class
../../../source/texk/web2c/mplibdir/mp.w:18578: error: syntax error 
before "cur_
exp"
../../../source/texk/web2c/mplibdir/mp.w:18578: warning: type defaults 
to `int'
in declaration of `cur_exp'
../../../source/texk/web2c/mplibdir/mp.w:18578: warning: data definition 
has no
type or storage class
../../../source/texk/web2c/mplibdir/mp.w:23249: error: syntax error 
before "eof_
line"
../../../source/texk/web2c/mplibdir/mp.w:23249: warning: type defaults 
to `int'
in declaration of `eof_line'
../../../source/texk/web2c/mplibdir/mp.w:23249: warning: data definition 
has no
type or storage class
../../../source/texk/web2c/mplibdir/mp.w:26275: error: syntax error 
before "run_
data"
../../../source/texk/web2c/mplibdir/mp.w:26275: warning: type defaults 
to `int'
in declaration of `run_data'
../../../source/texk/web2c/mplibdir/mp.w:26275: warning: data definition 
has no
type or storage class
../../../source/texk/web2c/mplibdir/mp.w:29922: error: syntax error 
before "font
_mem_size"
../../../source/texk/web2c/mplibdir/mp.w:29922: warning: type defaults 
to `int'
in declaration of `font_mem_size'
../../../source/texk/web2c/mplibdir/mp.w:29922: warning: data definition 
has no
type or storage class
../../../source/texk/web2c/mplibdir/mp.w:29926: error: syntax error 
before "next
_fmem"
../../../source/texk/web2c/mplibdir/mp.w:29926: warning: type defaults 
to `int'
in declaration of `next_fmem'
../../../source/texk/web2c/mplibdir/mp.w:29926: warning: data definition 
has no
type or storage class
../../../source/texk/web2c/mplibdir/mp.w:145: error: syntax error before 
'}' tok
en
../../../source/texk/web2c/mplibdir/mp.w:145: warning: type defaults to 
`int' in
  declaration of `MP_instance'
../../../source/texk/web2c/mplibdir/mp.w:145: warning: data definition 
has no ty
pe or storage class
../../../source/texk/web2c/mplibdir/mp.w:18013: error: syntax error 
before "str_
number"
../../../source/texk/web2c/mplibdir/mp.w:1140: error: syntax error 
before "str_n
umber"
../../../source/texk/web2c/mplibdir/mp.w:1484: error: syntax error 
before "str_n
umber"
../../../source/texk/web2c/mplibdir/mp.w:3056: error: syntax error 
before "size_
t"
../../../source/texk/web2c/mplibdir/mp.w:4899: error: syntax error 
before "mp_va
lue_data"
../../../source/texk/web2c/mplibdir/mp.w:4899: warning: no semicolon at 
end of s
truct or union
../../../source/texk/web2c/mplibdir/mp.w:4900: warning: type defaults to 
`int' i
n declaration of `mp_token_node_data'
../../../source/texk/web2c/mplibdir/mp.w:4900: warning: data definition 
has no t
ype or storage class
../../../source/texk/web2c/mplibdir/mp.w:5301: error: syntax error 
before "mp_va
lue_data"
../../../source/texk/web2c/mplibdir/mp.w:5301: warning: no semicolon at 
end of s
truct or union
../../../source/texk/web2c/mplibdir/mp.w:5309: error: syntax error 
before '}' to
ken
../../../source/texk/web2c/mplibdir/mp.w:5309: warning: type defaults to 
`int' i
n declaration of `mp_value_node_data'
../../../source/texk/web2c/mplibdir/mp.w:5309: warning: data definition 
has no t
ype or storage class
../../../source/texk/web2c/mplibdir/mp.w:9260: error: syntax error 
before "str_n
umber"
../../../source/texk/web2c/mplibdir/mp.w:9260: warning: no semicolon at 
end of s
truct or union
../../../source/texk/web2c/mplibdir/mp.w:9261: warning: type defaults to 
`int' i
n declaration of `post_script_'
../../../source/texk/web2c/mplibdir/mp.w:9261: warning: data definition 
has no t
ype or storage class
../../../source/texk/web2c/mplibdir/mp.w:9266: error: syntax error 
before '}' to
ken
../../../source/texk/web2c/mplibdir/mp.w:9266: warning: type defaults to 
`int' i
n declaration of `mp_fill_node_data'
../../../source/texk/web2c/mplibdir/mp.w:9266: warning: data definition 
has no t
ype or storage class
../../../source/texk/web2c/mplibdir/mp.w:9328: error: syntax error 
before "str_n
umber"
../../../source/texk/web2c/mplibdir/mp.w:9328: warning: no semicolon at 
end of s
truct or union
../../../source/texk/web2c/mplibdir/mp.w:9329: warning: type defaults to 
`int' i
n declaration of `post_script_'
../../../source/texk/web2c/mplibdir/mp.w:9329: warning: data definition 
has no t
ype or storage class
../../../source/texk/web2c/mplibdir/mp.w:9337: error: syntax error 
before '}' to
ken
../../../source/texk/web2c/mplibdir/mp.w:9337: warning: type defaults to 
`int' i
n declaration of `mp_stroked_node_data'
../../../source/texk/web2c/mplibdir/mp.w:9337: warning: data definition 
has no t
ype or storage class
../../../source/texk/web2c/mplibdir/mp.w:9461: error: syntax error 
before "str_n
umber"
../../../source/texk/web2c/mplibdir/mp.w:9461: warning: no semicolon at 
end of s
truct or union
../../../source/texk/web2c/mplibdir/mp.w:9462: warning: type defaults to 
`int' i
n declaration of `post_script_'
../../../source/texk/web2c/mplibdir/mp.w:9462: warning: data definition 
has no t
ype or storage class
../../../source/texk/web2c/mplibdir/mp.w:9463: error: syntax error 
before "text_
p_"
../../../source/texk/web2c/mplibdir/mp.w:9463: warning: type defaults to 
`int' i
n declaration of `text_p_'
../../../source/texk/web2c/mplibdir/mp.w:9463: warning: data definition 
has no t
ype or storage class
../../../source/texk/web2c/mplibdir/mp.w:9474: error: syntax error 
before '}' to
ken
../../../source/texk/web2c/mplibdir/mp.w:9474: warning: type defaults to 
`int' i
n declaration of `mp_text_node_data'
../../../source/texk/web2c/mplibdir/mp.w:9474: warning: data definition 
has no t
ype or storage class
../../../source/texk/web2c/mplibdir/tfmin.w: In function 
`mp_read_font_info':
../../../source/texk/web2c/mplibdir/tfmin.w:68: error: syntax error 
before "whd_
size"
../../../source/texk/web2c/mplibdir/tfmin.w:231: warning: implicit 
declaration o
f function `strlen'
../../../source/texk/web2c/mplibdir/tfmin.w:231: error: dereferencing 
pointer to
  incomplete type
../../../source/texk/web2c/mplibdir/tfmin.w:231: error: dereferencing 
pointer to
  incomplete type
../../../source/texk/web2c/mplibdir/tfmin.w:231: error: dereferencing 
pointer to
  incomplete type
../../../source/texk/web2c/mplibdir/tfmin.w:232: error: dereferencing 
pointer to
  incomplete type
../../../source/texk/web2c/mplibdir/tfmin.w:233: error: dereferencing 
pointer to
  incomplete type
../../../source/texk/web2c/mplibdir/tfmin.w:234: error: dereferencing 
pointer to
  incomplete type
../../../source/texk/web2c/mplibdir/tfmin.w:236: error: dereferencing 
pointer to
  incomplete type
../../../source/texk/web2c/mplibdir/tfmin.w:236: error: dereferencing 
pointer to
  incomplete type
../../../source/texk/web2c/mplibdir/tfmin.w:236: error: dereferencing 
pointer to
  incomplete type
../../../source/texk/web2c/mplibdir/tfmin.w:237: error: dereferencing 
pointer to
  incomplete type
../../../source/texk/web2c/mplibdir/tfmin.w:237: error: dereferencing 
pointer to
  incomplete type
../../../source/texk/web2c/mplibdir/tfmin.w:237: error: dereferencing 
pointer to
  incomplete type
../../../source/texk/web2c/mplibdir/tfmin.w:238: error: dereferencing 
pointer to
  incomplete type
../../../source/texk/web2c/mplibdir/tfmin.w:137: error: syntax error 
before "wan
ted"
../../../source/texk/web2c/mplibdir/tfmin.w:137: error: dereferencing 
pointer to
  incomplete type
../../../source/texk/web2c/mplibdir/tfmin.w:137: error: dereferencing 
pointer to
  incomplete type
../../../source/texk/web2c/mplibdir/tfmin.w:137: error: `wanted' 
undeclared (fir
st use in this function)
../../../source/texk/web2c/mplibdir/tfmin.w:137: error: syntax error 
before "wan
ted"
../../../source/texk/web2c/mplibdir/tfmin.w:137: error: dereferencing 
pointer to
  incomplete type
../../../source/texk/web2c/mplibdir/tfmin.w:137: error: dereferencing 
pointer to
  incomplete type
../../../source/texk/web2c/mplibdir/tfmin.w:138: error: syntax error 
before "wan
ted"
../../../source/texk/web2c/mplibdir/tfmin.w:138: error: dereferencing 
pointer to
  incomplete type
../../../source/texk/web2c/mplibdir/tfmin.w:138: error: dereferencing 
pointer to
  incomplete type
../../../source/texk/web2c/mplibdir/tfmin.w:138: error: syntax error 
before "wan
ted"
../../../source/texk/web2c/mplibdir/tfmin.w:138: error: dereferencing 
pointer to
  incomplete type
../../../source/texk/web2c/mplibdir/tfmin.w:138: error: dereferencing 
pointer to
  incomplete type
../../../source/texk/web2c/mplibdir/tfmin.w:139: error: syntax error 
before "wan
ted"
../../../source/texk/web2c/mplibdir/tfmin.w:139: error: dereferencing 
pointer to
  incomplete type
../../../source/texk/web2c/mplibdir/tfmin.w:139: error: dereferencing 
pointer to
  incomplete type
../../../source/texk/web2c/mplibdir/tfmin.w:139: error: syntax error 
before "wan
ted"
../../../source/texk/web2c/mplibdir/tfmin.w:139: error: dereferencing 
pointer to
  incomplete type
../../../source/texk/web2c/mplibdir/tfmin.w:139: error: dereferencing 
pointer to
  incomplete type
../../../source/texk/web2c/mplibdir/tfmin.w:140: error: syntax error 
before "wan
ted"
../../../source/texk/web2c/mplibdir/tfmin.w:140: error: dereferencing 
pointer to
  incomplete type
../../../source/texk/web2c/mplibdir/tfmin.w:140: error: dereferencing 
pointer to
  incomplete type
../../../source/texk/web2c/mplibdir/tfmin.w:140: error: syntax error 
before "wan
ted"
../../../source/texk/web2c/mplibdir/tfmin.w:140: error: dereferencing 
pointer to
  incomplete type
../../../source/texk/web2c/mplibdir/tfmin.w:140: error: dereferencing 
pointer to
  incomplete type
../../../source/texk/web2c/mplibdir/tfmin.w:142: error: syntax error 
before "wan
ted"
../../../source/texk/web2c/mplibdir/tfmin.w:142: error: dereferencing 
pointer to
  incomplete type
../../../source/texk/web2c/mplibdir/tfmin.w:142: error: dereferencing 
pointer to
  incomplete type
../../../source/texk/web2c/mplibdir/tfmin.w:142: error: syntax error 
before "wan
ted"
../../../source/texk/web2c/mplibdir/tfmin.w:142: error: dereferencing 
pointer to
  incomplete type
../../../source/texk/web2c/mplibdir/tfmin.w:142: error: dereferencing 
pointer to
  incomplete type
../../../source/texk/web2c/mplibdir/tfmin.w:143: error: syntax error 
before "wan
ted"
../../../source/texk/web2c/mplibdir/tfmin.w:143: error: dereferencing 
pointer to
  incomplete type
../../../source/texk/web2c/mplibdir/tfmin.w:143: error: dereferencing 
pointer to
  incomplete type
../../../source/texk/web2c/mplibdir/tfmin.w:143: error: syntax error 
before "wan
ted"
../../../source/texk/web2c/mplibdir/tfmin.w:143: error: dereferencing 
pointer to
  incomplete type
../../../source/texk/web2c/mplibdir/tfmin.w:143: error: dereferencing 
pointer to
  incomplete type
../../../source/texk/web2c/mplibdir/tfmin.w:144: error: syntax error 
before "wan
ted"
../../../source/texk/web2c/mplibdir/tfmin.w:144: error: dereferencing 
pointer to
  incomplete type
../../../source/texk/web2c/mplibdir/tfmin.w:144: error: dereferencing 
pointer to
  incomplete type
../../../source/texk/web2c/mplibdir/tfmin.w:144: error: syntax error 
before "wan
ted"
../../../source/texk/web2c/mplibdir/tfmin.w:144: error: dereferencing 
pointer to
  incomplete type
../../../source/texk/web2c/mplibdir/tfmin.w:144: error: dereferencing 
pointer to
  incomplete type
../../../source/texk/web2c/mplibdir/tfmin.w:145: error: `whd_size' 
undeclared (f
irst use in this function)
../../../source/texk/web2c/mplibdir/tfmin.w:145: error: called object is 
not a f
unction
../../../source/texk/web2c/mplibdir/tfmin.w:146: error: syntax error 
before "tfm
_lh"
../../../source/texk/web2c/mplibdir/tfmin.w:147: error: syntax error 
before "wan
ted"
../../../source/texk/web2c/mplibdir/tfmin.w:147: error: dereferencing 
pointer to
  incomplete type
../../../source/texk/web2c/mplibdir/tfmin.w:147: error: dereferencing 
pointer to
  incomplete type
../../../source/texk/web2c/mplibdir/tfmin.w:156: error: dereferencing 
pointer to
  incomplete type
../../../source/texk/web2c/mplibdir/tfmin.w:156: error: syntax error 
before "bc"

../../../source/texk/web2c/mplibdir/tfmin.w:158: error: dereferencing 
pointer to
  incomplete type
../../../source/texk/web2c/mplibdir/tfmin.w:158: error: dereferencing 
pointer to
  incomplete type
../../../source/texk/web2c/mplibdir/tfmin.w:159: error: dereferencing 
pointer to
  incomplete type
../../../source/texk/web2c/mplibdir/tfmin.w:159: error: dereferencing 
pointer to
  incomplete type
../../../source/texk/web2c/mplibdir/tfmin.w:160: error: dereferencing 
pointer to
  incomplete type
../../../source/texk/web2c/mplibdir/tfmin.w:160: error: dereferencing 
pointer to
  incomplete type
../../../source/texk/web2c/mplibdir/tfmin.w:161: error: syntax error 
before "l"
../../../source/texk/web2c/mplibdir/tfmin.w:163: error: `l' undeclared 
(first us
e in this function)
../../../source/texk/web2c/mplibdir/tfmin.w:165: error: dereferencing 
pointer to
  incomplete type
../../../source/texk/web2c/mplibdir/tfmin.w:165: error: dereferencing 
pointer to
  incomplete type
../../../source/texk/web2c/mplibdir/tfmin.w:166: error: dereferencing 
pointer to
  incomplete type
../../../source/texk/web2c/mplibdir/tfmin.w:167: error: dereferencing 
pointer to
  incomplete type
../../../source/texk/web2c/mplibdir/tfmin.w:168: error: dereferencing 
pointer to
  incomplete type
../../../source/texk/web2c/mplibdir/tfmin.w:170: error: dereferencing 
pointer to
  incomplete type
../../../source/texk/web2c/mplibdir/tfmin.w:171: error: dereferencing 
pointer to
  incomplete type
../../../source/texk/web2c/mplibdir/tfmin.w:172: error: dereferencing 
pointer to
  incomplete type
../../../source/texk/web2c/mplibdir/tfmin.w:173: error: dereferencing 
pointer to
  incomplete type
../../../source/texk/web2c/mplibdir/tfmin.w:174: error: dereferencing 
pointer to
  incomplete type
../../../source/texk/web2c/mplibdir/tfmin.w:174: error: dereferencing 
pointer to
  incomplete type
../../../source/texk/web2c/mplibdir/tfmin.w:174: error: syntax error 
before "bc"

../../../source/texk/web2c/mplibdir/tfmin.w:175: error: dereferencing 
pointer to
  incomplete type
../../../source/texk/web2c/mplibdir/tfmin.w:175: error: dereferencing 
pointer to
  incomplete type
../../../source/texk/web2c/mplibdir/tfmin.w:175: error: called object is 
not a f
unction
../../../source/texk/web2c/mplibdir/tfmin.w:176: error: dereferencing 
pointer to
  incomplete type
../../../source/texk/web2c/mplibdir/tfmin.w:176: error: dereferencing 
pointer to
  incomplete type
../../../source/texk/web2c/mplibdir/tfmin.w:177: error: dereferencing 
pointer to
  incomplete type
../../../source/texk/web2c/mplibdir/tfmin.w:177: error: dereferencing 
pointer to
  incomplete type
../../../source/texk/web2c/mplibdir/tfmin.w:178: error: dereferencing 
pointer to
  incomplete type
../../../source/texk/web2c/mplibdir/tfmin.w:178: error: dereferencing 
pointer to
  incomplete type
../../../source/texk/web2c/mplibdir/tfmin.w:183: error: syntax error 
before "wan
ted"
../../../source/texk/web2c/mplibdir/tfmin.w:183: error: dereferencing 
pointer to
  incomplete type
../../../source/texk/web2c/mplibdir/tfmin.w:183: error: dereferencing 
pointer to
  incomplete type
../../../source/texk/web2c/mplibdir/tfmin.w:184: error: syntax error 
before "wan
ted"
../../../source/texk/web2c/mplibdir/tfmin.w:184: error: dereferencing 
pointer to
  incomplete type
../../../source/texk/web2c/mplibdir/tfmin.w:184: error: dereferencing 
pointer to
  incomplete type
../../../source/texk/web2c/mplibdir/tfmin.w:184: error: syntax error 
before "wan
ted"
../../../source/texk/web2c/mplibdir/tfmin.w:184: error: dereferencing 
pointer to
  incomplete type
../../../source/texk/web2c/mplibdir/tfmin.w:184: error: dereferencing 
pointer to
  incomplete type
../../../source/texk/web2c/mplibdir/tfmin.w:185: error: syntax error 
before "wan
ted"
../../../source/texk/web2c/mplibdir/tfmin.w:185: error: dereferencing 
pointer to
  incomplete type
../../../source/texk/web2c/mplibdir/tfmin.w:185: error: dereferencing 
pointer to
  incomplete type
../../../source/texk/web2c/mplibdir/tfmin.w:186: error: syntax error 
before "wan
ted"
../../../source/texk/web2c/mplibdir/tfmin.w:186: error: dereferencing 
pointer to
  incomplete type
../../../source/texk/web2c/mplibdir/tfmin.w:186: error: dereferencing 
pointer to
  incomplete type
../../../source/texk/web2c/mplibdir/tfmin.w:187: error: dereferencing 
pointer to
  incomplete type
../../../source/texk/web2c/mplibdir/tfmin.w:189: error: syntax error 
before "wan
ted"
../../../source/texk/web2c/mplibdir/tfmin.w:189: error: dereferencing 
pointer to
  incomplete type
../../../source/texk/web2c/mplibdir/tfmin.w:189: error: dereferencing 
pointer to
  incomplete type
../../../source/texk/web2c/mplibdir/tfmin.w:192: error: dereferencing 
pointer to
  incomplete type
../../../source/texk/web2c/mplibdir/tfmin.w:193: error: dereferencing 
pointer to
  incomplete type
../../../source/texk/web2c/mplibdir/tfmin.w:195: error: syntax error 
before "wan
ted"
../../../source/texk/web2c/mplibdir/tfmin.w:195: error: dereferencing 
pointer to
  incomplete type
../../../source/texk/web2c/mplibdir/tfmin.w:195: error: dereferencing 
pointer to
  incomplete type
../../../source/texk/web2c/mplibdir/tfmin.w:195: error: dereferencing 
pointer to
  incomplete type
../../../source/texk/web2c/mplibdir/tfmin.w:196: error: syntax error 
before "wan
ted"
../../../source/texk/web2c/mplibdir/tfmin.w:196: error: dereferencing 
pointer to
  incomplete type
../../../source/texk/web2c/mplibdir/tfmin.w:196: error: dereferencing 
pointer to
  incomplete type
../../../source/texk/web2c/mplibdir/tfmin.w:197: error: dereferencing 
pointer to
  incomplete type
../../../source/texk/web2c/mplibdir/tfmin.w:198: error: dereferencing 
pointer to
  incomplete type
../../../source/texk/web2c/mplibdir/tfmin.w:199: error: syntax error 
before "wan
ted"
../../../source/texk/web2c/mplibdir/tfmin.w:199: error: dereferencing 
pointer to
  incomplete type
../../../source/texk/web2c/mplibdir/tfmin.w:199: error: dereferencing 
pointer to
  incomplete type
../../../source/texk/web2c/mplibdir/tfmin.w:199: error: syntax error 
before "wan
ted"
../../../source/texk/web2c/mplibdir/tfmin.w:199: error: dereferencing 
pointer to
  incomplete type
../../../source/texk/web2c/mplibdir/tfmin.w:199: error: dereferencing 
pointer to
  incomplete type
../../../source/texk/web2c/mplibdir/tfmin.w:202: error: dereferencing 
pointer to
  incomplete type
../../../source/texk/web2c/mplibdir/tfmin.w:216: error: syntax error 
before "wan
ted"
../../../source/texk/web2c/mplibdir/tfmin.w:216: error: dereferencing 
pointer to
  incomplete type
../../../source/texk/web2c/mplibdir/tfmin.w:216: error: dereferencing 
pointer to
  incomplete type
../../../source/texk/web2c/mplibdir/tfmin.w:218: error: syntax error 
before "wan
ted"
../../../source/texk/web2c/mplibdir/tfmin.w:218: error: dereferencing 
pointer to
  incomplete type
../../../source/texk/web2c/mplibdir/tfmin.w:218: error: dereferencing 
pointer to
  incomplete type
../../../source/texk/web2c/mplibdir/tfmin.w:219: error: syntax error 
before "wan
ted"
../../../source/texk/web2c/mplibdir/tfmin.w:219: error: dereferencing 
pointer to
  incomplete type
../../../source/texk/web2c/mplibdir/tfmin.w:219: error: dereferencing 
pointer to
  incomplete type
../../../source/texk/web2c/mplibdir/tfmin.w:220: error: syntax error 
before "wan
ted"
../../../source/texk/web2c/mplibdir/tfmin.w:220: error: dereferencing 
pointer to
  incomplete type
../../../source/texk/web2c/mplibdir/tfmin.w:220: error: dereferencing 
pointer to
  incomplete type
../../../source/texk/web2c/mplibdir/tfmin.w:221: error: dereferencing 
pointer to
  incomplete type
../../../source/texk/web2c/mplibdir/tfmin.w:221: error: dereferencing 
pointer to
  incomplete type
../../../source/texk/web2c/mplibdir/tfmin.w:100: error: dereferencing 
pointer to
  incomplete type
../../../source/texk/web2c/mplibdir/tfmin.w:100: error: dereferencing 
pointer to
  incomplete type
../../../source/texk/web2c/mplibdir/tfmin.w:100: error: dereferencing 
pointer to
  incomplete type
../../../source/texk/web2c/mplibdir/tfmin.w:100: error: dereferencing 
pointer to
  incomplete type
../../../source/texk/web2c/mplibdir/tfmin.w:104: error: dereferencing 
pointer to
  incomplete type
../../../source/texk/web2c/mplibdir/tfmin.w:82: error: dereferencing 
pointer to
incomplete type
../../../source/texk/web2c/mplibdir/tfmin.w:82: error: dereferencing 
pointer to
incomplete type
../../../source/texk/web2c/mplibdir/tfmin.w:84: error: dereferencing 
pointer to
incomplete type
../../../source/texk/web2c/mplibdir/tfmin.w:85: error: dereferencing 
pointer to
incomplete type
make[5]: *** [libmplib_a-tfmin.o] Error 1
make[4]: *** [all-recursive] Error 1
make[3]: *** [all] Error 2
make[2]: *** [subtexk] Error 1
make[1]: *** [all-recursive] Error 1
make: *** [all-recursive] Error 1
ls: build/texk/web2c/luatex.exe: No such file or directory



More information about the dev-luatex mailing list