[dev-context] luatex beta 0.36.0

Mojca Miklavec mojca.miklavec.lists at gmail.com
Mon Mar 23 21:23:28 CET 2009


On Mon, Mar 23, 2009 at 10:53, Taco Hoekwater wrote:
> Hi,
>
> I have just uploaded luatex 0.36.0.

Hello Taco,

I have some problems with compilation. Did other Mac users manage to
compile LuaTeX without problems?

 gcc -g -O2 -I/sw/include
-I/System/Library/Frameworks/Python.framework/Versions/2.3/include/python2.3
-I../inc -I../../../../../src/libs/luafontforge/fontforge/inc
-I../../../../../src/libs/luafontforge/fontforge/fontforge -I.
-Wmissing-prototypes -Wunused -Wimplicit -Wreturn-type -Wparentheses
-Wformat -Wchar-subscripts -DHAVE_CONFIG_H
-DSHAREDIR=\"/usr/local/share/fontforge\" -DLIBDIR=\"/usr/local/lib\"
-I/sw/include -I/System/Library/Frameworks/Python.framework/Versions/2.3/include/python2.3
-DPREFIX=\"/usr/local\" -c
../../../../../src/libs/luafontforge/fontforge/fontforge/cvexport.c -o
cvexport.o
../../../../../src/libs/luafontforge/fontforge/fontforge/cvexport.c:
In function ‘_ExportPlate’:
../../../../../src/libs/luafontforge/fontforge/fontforge/cvexport.c:297:
error: ‘spiro_cp’ undeclared (first use in this function)
../../../../../src/libs/luafontforge/fontforge/fontforge/cvexport.c:297:
error: (Each undeclared identifier is reported only once
../../../../../src/libs/luafontforge/fontforge/fontforge/cvexport.c:297:
error: for each function it appears in.)
../../../../../src/libs/luafontforge/fontforge/fontforge/cvexport.c:297:
error: ‘spiros’ undeclared (first use in this function)
../../../../../src/libs/luafontforge/fontforge/fontforge/cvexport.c:313:
error: ‘struct splinepointlist’ has no member named ‘spiros’
../../../../../src/libs/luafontforge/fontforge/fontforge/cvexport.c:314:
error: ‘struct splinepointlist’ has no member named ‘spiro_cnt’
../../../../../src/libs/luafontforge/fontforge/fontforge/cvexport.c:315:
warning: implicit declaration of function ‘SplineSet2SpiroCP’
../../../../../src/libs/luafontforge/fontforge/fontforge/cvexport.c:317:
error: ‘SPIRO_OPEN_CONTOUR’ undeclared (first use in this function)
../../../../../src/libs/luafontforge/fontforge/fontforge/cvexport.c:326:
error: ‘struct splinepointlist’ has no member named ‘spiros’
make[2]: *** [cvexport.lo] Error 1
make[1]: *** [fontforge] Error 2
make: *** [../../libs/luafontforge/libff.a] Error 2
cp: statusa »build/texk/web2c/luatex« ni moč ugotoviti s stat: No such
file or directory

Mojca


More information about the dev-context mailing list